Target
Malonyl-CoA decarboxylase, mitochondrial
Ligand
BDBM50328219
Substrate
Meas. Tech.
ChEMBL_665404 (CHEMBL1261133)
IC50
42±n/a nM
Citation
 Tang, HYan, YFeng, Zde Jesus, RKYang, LLevorse, DAOwens, KAAkiyama, TEBergeron, RCastriota, GADoebber, TWEllsworth, KPLassman, MELi, CWu, MSZhang, BBChapman, KTMills, SGBerger, JPPasternak, A Design and synthesis of a new class of malonyl-CoA decarboxylase inhibitors with anti-obesity and anti-diabetic activities. Bioorg Med Chem Lett 20:6088-92 (2010)  
Target
Name:
Malonyl-CoA decarboxylase, mitochondrial
Synonyms:
DCMC_HUMAN Malonyl-CoA decarboxylase
Type:
PROTEIN
Mol. Mass.:
55018.37
Organism:
Homo sapiens (Human)
Description:
ChEMBL_665404
Residue:
493
  
Inhibitor
Name:
BDBM50328219
Synonyms:
4-(4-(5-(1,1,1,3,3,3-hexafluoro-2-hydroxypropan-2-yl)thiazol-2-yl)piperazin-1-yl)benzonitrile | CHEMBL1258480
Type:
Small organic molecule
Emp. Form.:
C17H14F6N4OS
Mol. Mass.:
436.375
SMILES:
OC(c1cnc(s1)N1CCN(CC1)c1ccc(cc1)C#N)(C(F)(F)F)C(F)(F)F
: