Target
Cyclin-dependent kinase 2/G1/S-specific cyclin-E1/G1/S-specific cyclin-E2
Ligand
BDBM50328268
Substrate
Meas. Tech.
ChEMBL_665422 (CHEMBL1261151)
IC50
300±n/a nM
Citation
 Liu, JJDaniewski, IDing, QHiggins, BJu, GKolinsky, KKonzelmann, FLukacs, CPizzolato, GRossman, PSwain, AThakkar, KWei, CCMiklowski, DYang, HYin, XWovkulich, PM Pyrazolobenzodiazepines: part I. Synthesis and SAR of a potent class of kinase inhibitors. Bioorg Med Chem Lett 20:5984-7 (2010)  
Target
Name:
Cyclin-dependent kinase 2/G1/S-specific cyclin-E1/G1/S-specific cyclin-E2
Synonyms:
CDK2/Cyclin E/G1/S-specific cyclin E2 Cyclin-dependent kinase 2/cyclin E
Type:
Mol. Mass.:
Description:
ASSAY_ID of EBI is 52510
Components:
This complex has 3 components.
Component 1
Name:
G1/S-specific cyclin-E2
Synonyms:
CCNE2 CDK3/cyclin E | G1/S-specific cyclin-E2
Type:
PROTEIN
Mol. Mass.:
46763.82
Organism:
Homo sapiens (Human)
Description:
EBI_10135
Residue:
404
  
Component 2
Name:
Cyclin-dependent kinase 2
Synonyms:
CDK2 CDK2_HUMAN Cell division protein kinase 2 Protein cereblon/Cyclin-dependent kinase 2 | p33 protein kinase
Type:
Enzyme Subunit
Mol. Mass.:
33938.17
Organism:
Homo sapiens (Human)
Description:
P24941
Residue:
298
  
Component 3
Name:
G1/S-specific cyclin-E1
Synonyms:
CCNE CCNE1_HUMAN
Type:
Enzyme Subunit
Mol. Mass.:
47073.17
Organism:
Homo sapiens (Human)
Description:
Residue:
410
  
Inhibitor
Name:
BDBM50328268
Synonyms:
5-(2-chlorophenyl)-7-nitro-3-(pyridin-3-yl)-2,10-dihydrobenzo[e]pyrazolo[4,3-b][1,4]diazepine | CHEMBL1257434
Type:
Small organic molecule
Emp. Form.:
C21H13ClN6O2
Mol. Mass.:
416.82
SMILES:
[O-][N+](=O)c1ccc2Nc3[nH]nc(c3N=C(c3ccccc3Cl)c2c1)-c1cccnc1
: