Target
Focal adhesion kinase 1
Ligand
BDBM50328257
Substrate
Meas. Tech.
ChEMBL_665425 (CHEMBL1261154)
IC50
150±n/a nM
Citation
 Liu, JJDaniewski, IDing, QHiggins, BJu, GKolinsky, KKonzelmann, FLukacs, CPizzolato, GRossman, PSwain, AThakkar, KWei, CCMiklowski, DYang, HYin, XWovkulich, PM Pyrazolobenzodiazepines: part I. Synthesis and SAR of a potent class of kinase inhibitors. Bioorg Med Chem Lett 20:5984-7 (2010)  
Target
Name:
Focal adhesion kinase 1
Synonyms:
FADK 1 FAK1 FLT4 Focal adhesion kinase (FAK) Focal adhesion kinase 1 (FAK) Focal adhesion kinase-related nonkinase PTK2 Protein-tyrosine kinase 2 p125FAK | pp125FAK
Type:
Tyrosine-protein kinase
Mol. Mass.:
119233.17
Organism:
Homo sapiens (Human)
Description:
Q05397
Residue:
1052
  
Inhibitor
Name:
BDBM50328257
Synonyms:
5-(2-chlorophenyl)-2,10-dihydrobenzo[e]pyrazolo[4,3-b][1,4]diazepin-7-amine | CHEMBL1257911
Type:
Small organic molecule
Emp. Form.:
C16H12ClN5
Mol. Mass.:
309.753
SMILES:
Nc1ccc2Nc3[nH]ncc3N=C(c3ccccc3Cl)c2c1
: