Target
Sterol O-acyltransferase 1
Ligand
BDBM50328377
Substrate
Meas. Tech.
ChEMBL_665508 (CHEMBL1261339)
IC50
83±n/a nM
Citation
 Fox, BMIio, KLi, KChoi, RInaba, TJackson, SSagawa, SShan, BTanaka, MYoshida, AKayser, F Discovery of pyrrolopyridazines as novel DGAT1 inhibitors. Bioorg Med Chem Lett 20:6030-3 (2010)  
Target
Name:
Sterol O-acyltransferase 1
Synonyms:
ACACT ACAT Acetyl-CoA acetyltransferase, mitochondrial Acyl-CoA: cholesterol acyltransferase (ACAT) Cholesterol acyltransferase 1 SOAT1 STAT
Type:
Multi-pass membrane protein may form homo- or heterodimers.
Mol. Mass.:
64751.94
Organism:
Homo sapiens (Human)
Description:
P35610
Residue:
550
  
Inhibitor
Name:
BDBM50328377
Synonyms:
CHEMBL1258375 | ethyl 6-(3-tert-butyl-1,2,4-oxadiazol-5-yl)-2-morpholino-4-phenyl-7-propylpyrrolo[1,2-b]pyridazine-5-carboxylate
Type:
Small organic molecule
Emp. Form.:
C29H35N5O4
Mol. Mass.:
517.6193
SMILES:
CCCc1c(-c2nc(no2)C(C)(C)C)c(C(=O)OCC)c2c(cc(nn12)N1CCOCC1)-c1ccccc1
: