Target
5-hydroxytryptamine receptor 2A
Ligand
BDBM50328447
Substrate
Meas. Tech.
ChEMBL_665580 (CHEMBL1261464)
Ki
690±n/a nM
Citation
 Skultety, MHübner, HLöber, SGmeiner, P Bioisosteric replacement leading to biologically active [2.2]paracyclophanes with altered binding profiles for aminergic G-protein-coupled receptors. J Med Chem 53:7219-28 (2010)  
Target
Name:
5-hydroxytryptamine receptor 2A
Synonyms:
5-HT-2 5-HT2 5HT2A_PIG Serotonin 2a (5-HT2a) receptor
Type:
Enzyme Catalytic Domain
Mol. Mass.:
52679.13
Organism:
PIG
Description:
5-HT2 0 0::P50129
Residue:
470
  
Inhibitor
Name:
BDBM50328447
Synonyms:
4-[4-(4-Chlorophenyl)-4-hydroxypiperidin-1-yl]-1-(2,5-dimethylphenyl)butan-1-one | CHEMBL1257811
Type:
Small organic molecule
Emp. Form.:
C23H28ClNO2
Mol. Mass.:
385.927
SMILES:
Cc1ccc(C)c(c1)C(=O)CCCN1CCC(O)(CC1)c1ccc(Cl)cc1
: