Target
5-hydroxytryptamine receptor 6
Ligand
BDBM50328463
Substrate
Meas. Tech.
ChEMBL_665589 (CHEMBL1261473)
Ki
27±n/a nM
Citation
 Vázquez-Villa, HGonzález-Vera, JABenhamú, BViso, AFernández de la Pradilla, RJunquera, EAicart, ELópez-Rodríguez, MLOrtega-Gutiérrez, S Development of molecular probes for the human 5-HT(6) receptor. J Med Chem 53:7095-106 (2010)  
Target
Name:
5-hydroxytryptamine receptor 6
Synonyms:
5-HT-6 5-hydroxytryptamine receptor 6 (5-HT-6) 5-hydroxytryptamine receptor 6 (5HT6) HTR6 Serotonin 6 (5-HT6) receptor | Serotonin Receptor 6
Type:
G Protein-Coupled Receptor (GPCR)
Mol. Mass.:
46968.43
Organism:
Homo sapiens (Human)
Description:
P50406
Residue:
440
  
Inhibitor
Name:
BDBM50328463
Synonyms:
5-Chloro-N-{[5-(dimethylamino)-1-naphthyl]sulfonyl}-N-(4-methoxy-3-piperazin-1-ylphenyl)-3-methyl-1-benzothiophene-2-sulfonamide | CHEMBL1256252
Type:
Small organic molecule
Emp. Form.:
C32H33ClN4O5S3
Mol. Mass.:
685.276
SMILES:
COc1ccc(cc1N1CCNCC1)N(S(=O)(=O)c1sc2ccc(Cl)cc2c1C)S(=O)(=O)c1cccc2c(cccc12)N(C)C
: