Target
Excitatory amino acid transporter 1
Ligand
BDBM50292997
Substrate
Meas. Tech.
ChEMBL_665667 (CHEMBL1261598)
IC50
660±n/a nM
Citation
 Erichsen, MNHuynh, THAbrahamsen, BBastlund, JFBundgaard, CMonrad, OBekker-Jensen, ANielsen, CWFrydenvang, KJensen, AABunch, L Structure-activity relationship study of first selective inhibitor of excitatory amino acid transporter subtype 1: 2-Amino-4-(4-methoxyphenyl)-7-(naphthalen-1-yl)-5-oxo-5,6,7,8-tetrahydro-4H-chromene-3-carbonitrile (UCPH-101). J Med Chem 53:7180-91 (2010)  
Target
Name:
Excitatory amino acid transporter 1
Synonyms:
EAA1_HUMAN Excitatory Amino Acid EAAT1 GLAST1 | SLC1A3
Type:
Enzyme Catalytic Domain
Mol. Mass.:
59577.19
Organism:
Homo sapiens (Human)
Description:
Excitatory Amino Acid EAAT1 0 HUMAN::P43003
Residue:
542
  
Inhibitor
Name:
BDBM50292997
Synonyms:
2-Amino-4-(4-methoxyphenyl)-7-(naphthalene-1-yl)-5-oxo-5,6,7,8-tetrahydro-4H-chromene-3-carbonitrile | CHEMBL474133
Type:
Small organic molecule
Emp. Form.:
C27H22N2O3
Mol. Mass.:
422.4752
SMILES:
COc1ccc(cc1)C1C(C#N)C(=N)OC2=C1C(=O)CC(C2)c1cccc2ccccc12
: