Target
Cannabinoid receptor 2
Ligand
BDBM50328672
Substrate
Meas. Tech.
ChEMBL_665778 (CHEMBL1259269)
Ki
2.76±n/a nM
Citation
 Nikas, SPAlapafuja, SOPapanastasiou, IParonis, CAShukla, VGPapahatjis, DPBowman, ALHalikhedkar, AHan, XMakriyannis, A Novel 1',1'-chain substituted hexahydrocannabinols: 9ß-hydroxy-3-(1-hexyl-cyclobut-1-yl)-hexahydrocannabinol (AM2389) a highly potent cannabinoid receptor 1 (CB1) agonist. J Med Chem 53:6996-7010 (2010)  
Target
Name:
Cannabinoid receptor 2
Synonyms:
CANNABINOID CB2 CB2 Cannabinoid CB2 receptor Cannabinoid receptor 2 mCB2
Type:
Enzyme Catalytic Domain
Mol. Mass.:
38220.43
Organism:
MOUSE
Description:
P47936
Residue:
347
  
Inhibitor
Name:
BDBM50328672
Synonyms:
(6aR,9R,10aR)-3-[1-(5-Bromopentyl)cyclobutyl]-6a,7,8,9,10,10a-hexahydro-6,6-dimethyl-6H-dibenzo[b,d]pyran-1,9 diol | CHEMBL1259091
Type:
Small organic molecule
Emp. Form.:
C24H35BrO3
Mol. Mass.:
451.437
SMILES:
CC1(C)Oc2cc(cc(O)c2[C@@H]2C[C@H](O)CC[C@@H]12)C1(CCCCCBr)CCC1
: