Target
Cannabinoid receptor 2
Ligand
BDBM50328666
Substrate
Meas. Tech.
ChEMBL_665780 (CHEMBL1259271)
Ki
1.32±n/a nM
Citation
 Nikas, SPAlapafuja, SOPapanastasiou, IParonis, CAShukla, VGPapahatjis, DPBowman, ALHalikhedkar, AHan, XMakriyannis, A Novel 1',1'-chain substituted hexahydrocannabinols: 9ß-hydroxy-3-(1-hexyl-cyclobut-1-yl)-hexahydrocannabinol (AM2389) a highly potent cannabinoid receptor 1 (CB1) agonist. J Med Chem 53:6996-7010 (2010)  
Target
Name:
Cannabinoid receptor 2
Synonyms:
CANNABINOID CB2 CB2 CB2B CNR2_HUMAN Cannabinoid CB2 receptor Cannabinoid receptor 2 (CB2R) | hCB2
Type:
G Protein-Coupled Receptor (GPCR)
Mol. Mass.:
39690.94
Organism:
Homo sapiens (Human)
Description:
P34972
Residue:
360
  
Inhibitor
Name:
BDBM50328666
Synonyms:
(6aR,10aR)-3-[1-(5-Bromopentyl)cyclopentyl]-6,6a,7,8,10,10ahexahydro-1-hydroxy-6,6-dimethyl-9H-dibenzo[b,d]pyran-9-one | CHEMBL1259037
Type:
Small organic molecule
Emp. Form.:
C25H35BrO3
Mol. Mass.:
463.448
SMILES:
CC1(C)Oc2cc(cc(O)c2[C@@H]2CC(=O)CC[C@@H]12)C1(CCCCCBr)CCCC1
: