Target
Beta-lactamase
Ligand
BDBM50053173
Substrate
Meas. Tech.
ChEMBL_667619 (CHEMBL1262649)
IC50
80±n/a nM
Citation
 Mendonça, NManageiro, VRobin, FSalgado, MJFerreira, ECaniça, MBonnet, R The Lys234Arg substitution in the enzyme SHV-72 is a determinant for resistance to clavulanic acid inhibition. Antimicrob Agents Chemother 52:1806-11 (2008)  
Target
Name:
Beta-lactamase
Synonyms:
Type:
PROTEIN
Mol. Mass.:
31316.76
Organism:
Klebsiella pneumoniae
Description:
ChEMBL_667619
Residue:
286
  
Inhibitor
Name:
BDBM50053173
Synonyms:
(2S,3S,5R)-3-Methyl-4,4,7-trioxo-3-[1,2,3]triazol-1-ylmethyl-4-thia-1-aza-bicyclo[3.2.0]heptane-2-carboxylic acid (2S,3S,5R)-3-methyl-4,4,7-trioxo-3-[1,2,3]triazol-1-ylmethyl-4lambda6-thia-1-aza-bicyclo[3.2.0]heptane-2-carboxylic acid 3-Methyl-4,4,7-trioxo-3-[1,2,3]triazol-1-ylmethyl-4lambda*6*-thia-1-aza-bicyclo[3.2.0]heptane-2-carboxylic acid CL-298741 US9120808, Tazobactam sodium salt YTR-830H | Zosyn
Type:
Small organic molecule
Emp. Form.:
C10H12N4O5S
Mol. Mass.:
300.291
SMILES:
C[C@]1(Cn2ccnn2)[C@@H](N2[C@@H](CC2=O)S1(=O)=O)C(O)=O
: