Target
Histone deacetylase 7
Ligand
BDBM19410
Substrate
Meas. Tech.
ChEMBL_672865 (CHEMBL1267840)
IC50
>100000±n/a nM
Citation
 Hutt, DMHerman, DRodrigues, APNoel, SPilewski, JMMatteson, JHoch, BKellner, WKelly, JWSchmidt, AThomas, PJMatsumura, YSkach, WRGentzsch, MRiordan, JRSorscher, EJOkiyoneda, TYates, JRLukacs, GLFrizzell, RAManning, GGottesfeld, JMBalch, WE Reduced histone deacetylase 7 activity restores function to misfolded CFTR in cystic fibrosis. Nat Chem Biol 6:25-33 (2009)  
Target
Name:
Histone deacetylase 7
Synonyms:
HD7 HDAC7A Histone acetylase 7 (HDAC7) Human HDAC7
Type:
Chromatin regulator; hydrolase; repressor
Mol. Mass.:
102942.62
Organism:
Homo sapiens (Human)
Description:
Q8WUI4
Residue:
952
  
Inhibitor
Name:
BDBM19410
Synonyms:
CHEMBL27759 US11377423, MS-275 US9265734, MS-275 benzamide-type inhibitor, 3 | pyridin-3-ylmethyl N-({4-[(2-aminophenyl)carbamoyl]phenyl}methyl)carbamate
Type:
Small organic molecule
Emp. Form.:
C21H20N4O3
Mol. Mass.:
376.4085
SMILES:
Nc1ccccc1NC(=O)c1ccc(CNC(=O)OCc2cccnc2)cc1
: