Target
Cytochrome P450 3A4
Ligand
BDBM50328778
Substrate
Meas. Tech.
ChEMBL_673771 (CHEMBL1274948)
IC50
4±n/a nM
Citation
 Truong, APTóth, GProbst, GDSealy, JMBowers, SWone, DWDressen, DHom, RKKonradi, AWSham, HLWu, JPeterson, BTRuslim, LBova, MPKholodenko, DMotter, RNBard, FSantiago, PNi, HChian, DSoriano, FCole, TBrigham, EFWong, KZmolek, WGoldbach, ESamant, BChen, LZhang, HNakamura, DFQuinn, KPYednock, TASauer, JM Design of an orally efficacious hydroxyethylamine (HEA) BACE-1 inhibitor in a preclinical animal model. Bioorg Med Chem Lett 20:6231-6 (2010)  
Target
Name:
Cytochrome P450 3A4
Synonyms:
Albendazole monooxygenase CP3A4_HUMAN CYP3A4 CYPIIIA4 Cytochrome P450 3A4 (CYP3A4) Nifedipine oxidase Taurochenodeoxycholate 6-alpha-hydroxylase
Type:
Enzyme
Mol. Mass.:
57349.57
Organism:
Homo sapiens (Human)
Description:
Residue:
503
  
Inhibitor
Name:
BDBM50328778
Synonyms:
CHEMBL1270362 | N-((2S,3R)-4-(1-(3-(1,1-difluoro-2-methylpropan-2-yl)phenyl)cyclopropylamino)-1-(3,5-difluorophenyl)-3-hydroxybutan-2-yl)acetamide
Type:
Small organic molecule
Emp. Form.:
C25H30F4N2O2
Mol. Mass.:
466.5115
SMILES:
CC(=O)N[C@@H](Cc1cc(F)cc(F)c1)[C@H](O)CNC1(CC1)c1cccc(c1)C(C)(C)C(F)F
: