Target
11-beta-hydroxysteroid dehydrogenase 1
Ligand
BDBM50233538
Substrate
Meas. Tech.
ChEMBL_674864 (CHEMBL1272437)
IC50
778±n/a nM
Citation
 Stanetty, CCzollner, LKoller, IShah, PGaware, RCunha, TDOdermatt, AJordis, UKosma, PClassen-Houben, D Synthesis of novel 3-amino and 29-hydroxamic acid derivatives of glycyrrhetinic acid as selective 11ß-hydroxysteroid dehydrogenase 2 inhibitors. Bioorg Med Chem 18:7522-41 (2010)  
Target
Name:
11-beta-hydroxysteroid dehydrogenase 1
Synonyms:
11-DH 11-beta-Hydroxysteroid Dehydrogenase 1 (11-beta-HSD1) 11-beta-hydroxysteroid dehydrogenase 1 (11HSD1) Corticosteroid 11-beta-dehydrogenase isozyme 1 (11-beta-HSD-1) Corticosteroid 11-beta-dehydrogenase isozyme 1 (11beta-HSD1) HSD11 HSD11L | SDR26C1
Type:
Enzyme
Mol. Mass.:
32409.16
Organism:
Homo sapiens (Human)
Description:
P28845
Residue:
292
  
Inhibitor
Name:
BDBM50233538
Synonyms:
18beta-glycyrrhetic acid CHEMBL230006 glycyrrhetinic acid
Type:
Small organic molecule
Emp. Form.:
C30H46O4
Mol. Mass.:
470.6838
SMILES:
CC1(C)[C@@H](O)CC[C@@]2(C)[C@H]1CC[C@]1(C)[C@@H]2C(=O)C=C2[C@@H]3C[C@](C)(CC[C@]3(C)CC[C@@]12C)C(O)=O
: