Target
17-beta-hydroxysteroid dehydrogenase type 2
Ligand
BDBM50329316
Substrate
Meas. Tech.
ChEMBL_675396 (CHEMBL1273476)
IC50
>10000±n/a nM
Citation
 Tice, CMZhao, WKrosky, PMKruk, BABerbaum, JJohnson, JABukhtiyarov, YPanemangalore, RScott, BBZhao, YBruno, JGHoward, LTogias, JYe, YJSingh, SBMcKeever, BMLindblom, PRGuo, JGuo, RNar, HSchuler-Metz, AGregg, RELeftheris, KHarrison, RKMcGeehan, GMZhuang, LClaremon, DA Discovery and optimization of adamantyl carbamate inhibitors of 11ß-HSD1. Bioorg Med Chem Lett 20:6725-9 (2010)  
Target
Name:
17-beta-hydroxysteroid dehydrogenase type 2
Synonyms:
17-beta-Hydroxysteroid Dehydrogenase 2 (17-beta-HSD2) 20-alpha-HSD EDH17B2 Estradiol 17-beta-dehydrogenase 2 (17beta-HSD2) Microsomal 17-beta-hydroxysteroid dehydrogenas Testosterone 17-beta-dehydrogenase
Type:
Oxidoreductase; single-pass type II membrane protein
Mol. Mass.:
42795.29
Organism:
Homo sapiens (Human)
Description:
Enzyme was partially purified from human placenta.
Residue:
387
  
Inhibitor
Name:
BDBM50329316
Synonyms:
(R)-3-(5-Cyano-pyridin-2-ylamino)-pyrrolidine-1-carboxylic acid 5-carbamoyl-adamantan-2-yl ester | CHEMBL1270001
Type:
Small organic molecule
Emp. Form.:
C22H27N5O3
Mol. Mass.:
409.4815
SMILES:
NC(=O)[C@@]12CC3CC(C1)[C@H](OC(=O)N1CC[C@H](C1)Nc1ccc(cn1)C#N)C(C3)C2
: