Target
11-beta-hydroxysteroid dehydrogenase type 2
Ligand
BDBM50329316
Substrate
Meas. Tech.
ChEMBL_675399 (CHEMBL1273479)
IC50
8650±n/a nM
Citation
 Tice, CMZhao, WKrosky, PMKruk, BABerbaum, JJohnson, JABukhtiyarov, YPanemangalore, RScott, BBZhao, YBruno, JGHoward, LTogias, JYe, YJSingh, SBMcKeever, BMLindblom, PRGuo, JGuo, RNar, HSchuler-Metz, AGregg, RELeftheris, KHarrison, RKMcGeehan, GMZhuang, LClaremon, DA Discovery and optimization of adamantyl carbamate inhibitors of 11ß-HSD1. Bioorg Med Chem Lett 20:6725-9 (2010)  
Target
Name:
11-beta-hydroxysteroid dehydrogenase type 2
Synonyms:
11-DH2 11-beta-Hydroxysteroid Dehydrogenase 2 (11-beta-HSD2) 11-beta-hydroxysteroid dehydrogenase 2 11-beta-hydroxysteroid dehydrogenase type 2 (11-beta-HSD2) DHI2_HUMAN HSD11K SDR9C3
Type:
Enzyme
Mol. Mass.:
44141.72
Organism:
Homo sapiens (Human)
Description:
Purified recombinant human 11beta-HSD2.
Residue:
405
  
Inhibitor
Name:
BDBM50329316
Synonyms:
(R)-3-(5-Cyano-pyridin-2-ylamino)-pyrrolidine-1-carboxylic acid 5-carbamoyl-adamantan-2-yl ester | CHEMBL1270001
Type:
Small organic molecule
Emp. Form.:
C22H27N5O3
Mol. Mass.:
409.4815
SMILES:
NC(=O)[C@@]12CC3CC(C1)[C@H](OC(=O)N1CC[C@H](C1)Nc1ccc(cn1)C#N)C(C3)C2
: