Target
11-beta-hydroxysteroid dehydrogenase 1
Ligand
BDBM50329317
Substrate
Meas. Tech.
ChEMBL_675393 (CHEMBL1273473)
IC50
7.6±n/a nM
Citation
 Tice, CMZhao, WKrosky, PMKruk, BABerbaum, JJohnson, JABukhtiyarov, YPanemangalore, RScott, BBZhao, YBruno, JGHoward, LTogias, JYe, YJSingh, SBMcKeever, BMLindblom, PRGuo, JGuo, RNar, HSchuler-Metz, AGregg, RELeftheris, KHarrison, RKMcGeehan, GMZhuang, LClaremon, DA Discovery and optimization of adamantyl carbamate inhibitors of 11ß-HSD1. Bioorg Med Chem Lett 20:6725-9 (2010)  
Target
Name:
11-beta-hydroxysteroid dehydrogenase 1
Synonyms:
11-DH 11-beta-Hydroxysteroid Dehydrogenase 1 (11-beta-HSD1) 11-beta-hydroxysteroid dehydrogenase 1 (11HSD1) Corticosteroid 11-beta-dehydrogenase isozyme 1 (11-beta-HSD-1) Corticosteroid 11-beta-dehydrogenase isozyme 1 (11beta-HSD1) HSD11 HSD11L | SDR26C1
Type:
Enzyme
Mol. Mass.:
32409.16
Organism:
Homo sapiens (Human)
Description:
P28845
Residue:
292
  
Inhibitor
Name:
BDBM50329317
Synonyms:
(S)-3-(3-Cyano-pyridin-2-ylamino)-pyrrolidine-1-carboxylic acid 5-carbamoyl-adamantan-2-yl ester | CHEMBL1270002
Type:
Small organic molecule
Emp. Form.:
C22H27N5O3
Mol. Mass.:
409.4815
SMILES:
NC(=O)[C@@]12CC3CC(C1)[C@H](OC(=O)N1CC[C@@H](C1)Nc1ncccc1C#N)C(C3)C2
: