Target
Polyunsaturated fatty acid lipoxygenase ALOX15
Ligand
BDBM50329320
Substrate
Meas. Tech.
ChEMBL_675422 (CHEMBL1273502)
IC50
19±n/a nM
Citation
 Rai, GKenyon, VJadhav, ASchultz, LArmstrong, MJameson, JBHoobler, ELeister, WSimeonov, AHolman, TRMaloney, DJ Discovery of potent and selective inhibitors of human reticulocyte 15-lipoxygenase-1. J Med Chem 53:7392-404 (2010)  
Target
Name:
Polyunsaturated fatty acid lipoxygenase ALOX15
Synonyms:
15-Lipoxygenase-1 (15-LOX-1) Arachidonate 15-lipoxygenase LOG15 Reticulocyte 15-lipoxygenase-1 | Sphingosine 1-phosphate receptor 1 (S1P1)
Type:
Protein
Mol. Mass.:
74804.05
Organism:
Homo sapiens (Human)
Description:
Residue:
662
  
Inhibitor
Name:
BDBM50329320
Synonyms:
4-(5-(Naphthalen-1-yl)-1,3,4-oxadiazol-2-ylthio)but-2-ynylThiophene-2-carboxylate | CHEMBL1270217
Type:
Small organic molecule
Emp. Form.:
C21H14N2O3S2
Mol. Mass.:
406.477
SMILES:
O=C(OCC#CCSc1nnc(o1)-c1cccc2ccccc12)c1cccs1
: