Target
Apoptosis regulator Bcl-2
Ligand
BDBM50060993
Substrate
Meas. Tech.
ChEMBL_675631 (CHEMBL1273939)
Kd
430000±n/a nM
Citation
 Petros, AMHuth, JROost, TPark, CMDing, HWang, XZhang, HNimmer, PMendoza, RSun, CMack, JWalter, KDorwin, SGramling, ELadror, URosenberg, SHElmore, SWFesik, SWHajduk, PJ Discovery of a potent and selective Bcl-2 inhibitor using SAR by NMR. Bioorg Med Chem Lett 20:6587-91 (2010)  
Target
Name:
Apoptosis regulator Bcl-2
Synonyms:
Apoptosis regulator Bcl-2 Protein BCL-2 BCL2_HUMAN | Bcl-2 Protein
Type:
Homodimer or heterodimer
Mol. Mass.:
26269.11
Organism:
Homo sapiens (Human)
Description:
P10415
Residue:
239
  
Inhibitor
Name:
BDBM50060993
Synonyms:
4'-FLUORO-1,1'-BIPHENYL-4-CARBOXYLIC ACID CHEMBL106708
Type:
Small organic molecule
Emp. Form.:
C13H9FO2
Mol. Mass.:
216.2078
SMILES:
OC(=O)c1ccc(cc1)-c1ccc(F)cc1
: