Target
Polyunsaturated fatty acid 5-lipoxygenase
Ligand
BDBM50329399
Substrate
Meas. Tech.
ChEMBL_675639 (CHEMBL1273947)
IC50
7310±n/a nM
Citation
 Song, HOh, SRLee, HKHan, GKim, JHChang, HWDoh, KERhee, HKChoo, HY Synthesis and evaluation of benzoxazole derivatives as 5-lipoxygenase inhibitors. Bioorg Med Chem 18:7580-5 (2010)  
Target
Name:
Polyunsaturated fatty acid 5-lipoxygenase
Synonyms:
5-LO Alox5 LOX5_MOUSE
Type:
PROTEIN
Mol. Mass.:
77961.27
Organism:
Mus musculus
Description:
ChEMBL_675639
Residue:
674
  
Inhibitor
Name:
BDBM50329399
Synonyms:
6-Methyl-N-(4-(methylthio)phenyl)benzo[d]oxazol-2-amine | CHEMBL1269650
Type:
Small organic molecule
Emp. Form.:
C15H14N2OS
Mol. Mass.:
270.349
SMILES:
CSc1ccc(Nc2nc3cc(C)ccc3o2)cc1
: