Target
D(4) dopamine receptor
Ligand
BDBM50329406
Substrate
Meas. Tech.
ChEMBL_675650 (CHEMBL1274011)
Ki
63.95±n/a nM
Citation
 Lacivita, EDe Giorgio, PLee, ITRodeheaver, SIWeiss, BAFracasso, CCaccia, SBerardi, FPerrone, RZhang, MRMaeda, JHiguchi, MSuhara, TSchetz, JALeopoldo, M Design, synthesis, radiolabeling, and in vivo evaluation of carbon-11 labeled N-[2-[4-(3-cyanopyridin-2-yl)piperazin-1-yl]ethyl]-3-methoxybenzamide, a potential positron emission tomography tracer for the dopamine D(4) receptors. J Med Chem 53:7344-55 (2010)  
Target
Name:
D(4) dopamine receptor
Synonyms:
D(4) dopamine receptor DOPAMINE D4.4 Dopamine receptor | Drd4
Type:
Enzyme Catalytic Domain
Mol. Mass.:
41307.65
Organism:
RAT
Description:
DOPAMINE D4.4 0 RAT::P30729
Residue:
387
  
Inhibitor
Name:
BDBM50329406
Synonyms:
CHEMBL1270120 | N-[2-[4-(4-Cyanophenyl)piperazin-1-yl]ethyl]-3-methoxybenzamide
Type:
Small organic molecule
Emp. Form.:
C21H24N4O2
Mol. Mass.:
364.4409
SMILES:
COc1cccc(c1)C(=O)NCCN1CCN(CC1)c1ccc(cc1)C#N
: