Target
Cyclin-dependent kinase 5 activator 1
Ligand
BDBM50329427
Substrate
Meas. Tech.
ChEMBL_673935 (CHEMBL1275112)
IC50
>10000±n/a nM
Citation
 Menichincheri, MAlbanese, CAlli, CBallinari, DBargiotti, ACaldarelli, MCiavolella, ACirla, AColombo, MColotta, FCroci, VD'Alessio, RD'Anello, MErmoli, AFiorentini, FForte, BGalvani, AGiordano, PIsacchi, AMartina, KMolinari, AMoll, JKMontagnoli, AOrsini, POrzi, FPesenti, EPillan, ARoletto, FScolaro, ATatò, MTibolla, MValsasina, BVarasi, MVianello, PVolpi, DSantocanale, CVanotti, E Cdc7 kinase inhibitors: 5-heteroaryl-3-carboxamido-2-aryl pyrroles as potential antitumor agents. 1. Lead finding. J Med Chem 53:7296-315 (2010)  
Target
Name:
Cyclin-dependent kinase 5 activator 1
Synonyms:
CDK5/p35 Cyclin-dependent kinase 5 regulatory subunit 1 | Cyclin-dependent kinase 5/CDK5 activator 1
Type:
Protein Complex
Mol. Mass.:
Description:
Components:
This complex has 2 components.
Component 1
Name:
Cyclin-dependent kinase 5
Synonyms:
CDK5 CDKN5 Cyclin-dependent kinase 5 (CDK5/ p25) Cyclin-dependent-like kinase 5 PSSALRE Tau protein kinase II catalytic subunit
Type:
Enzyme Subunit
Mol. Mass.:
33308.61
Organism:
Homo sapiens (Human)
Description:
Residue:
292
  
Component 2
Name:
Cyclin-dependent kinase 5 activator 1
Synonyms:
CD5R1_HUMAN CDK5R1 Cyclin-dependent kinase 5 (CDK5/p25) NCK5A p35
Type:
Enzyme Subunit
Mol. Mass.:
34077.43
Organism:
Homo sapiens (Human)
Description:
Q15078
Residue:
307
  
Inhibitor
Name:
BDBM50329427
Synonyms:
5-(2-Amino-pyrimidin-4-yl)-2-phenyl-1H-pyrrole-3-carboxamide US9670191, U1
Type:
Small organic molecule
Emp. Form.:
C15H13N5O
Mol. Mass.:
279.2966
SMILES:
NC(=O)c1cc([nH]c1-c1ccccc1)-c1ccnc(N)n1
: