Target
Cell division cycle 7-related protein kinase
Ligand
BDBM50329419
Substrate
Meas. Tech.
ChEMBL_674074 (CHEMBL1274171)
IC50
2±n/a nM
Citation
 Menichincheri, MAlbanese, CAlli, CBallinari, DBargiotti, ACaldarelli, MCiavolella, ACirla, AColombo, MColotta, FCroci, VD'Alessio, RD'Anello, MErmoli, AFiorentini, FForte, BGalvani, AGiordano, PIsacchi, AMartina, KMolinari, AMoll, JKMontagnoli, AOrsini, POrzi, FPesenti, EPillan, ARoletto, FScolaro, ATatò, MTibolla, MValsasina, BVarasi, MVianello, PVolpi, DSantocanale, CVanotti, E Cdc7 kinase inhibitors: 5-heteroaryl-3-carboxamido-2-aryl pyrroles as potential antitumor agents. 1. Lead finding. J Med Chem 53:7296-315 (2010)  
Target
Name:
Cell division cycle 7-related protein kinase
Synonyms:
CDC7 CDC7L1 Cell division cycle 7-related protein kinase (CDC7) huCdc7
Type:
Protein
Mol. Mass.:
63908.16
Organism:
Homo sapiens (Human)
Description:
O00311
Residue:
574
  
Inhibitor
Name:
BDBM50329419
Synonyms:
5-(2-amino-5-bromopyrimidin-4-yl)-2-p-tolyl-1H-pyrrole-3-carboxamide US9670191, N2
Type:
Small organic molecule
Emp. Form.:
C15H12BrN5O
Mol. Mass.:
358.193
SMILES:
NC(=O)c1cc([nH]c1-c1ccccc1)-c1nc(N)ncc1Br
: