Target
Beta-secretase 1
Ligand
BDBM50303727
Substrate
Meas. Tech.
ChEMBL_674725 (CHEMBL1273978)
EC50
20±n/a nM
Citation
 Malamas, MSRobichaud, AErdei, JQuagliato, DSolvibile, WZhou, PMorris, KTurner, JWagner, EFan, KOlland, AJacobsen, SReinhart, PRiddell, DPangalos, M Design and synthesis of aminohydantoins as potent and selective humanß-secretase (BACE1) inhibitors with enhanced brain permeability. Bioorg Med Chem Lett 20:6597-605 (2010)  
Target
Name:
Beta-secretase 1
Synonyms:
ASP2 Aspartyl protease 2 BACE1 Beta-secretase (BACE) Beta-secretase 1 (BACE 1) Beta-secretase 1 (BACE1) Beta-site amyloid precursor protein cleaving enzyme 1 Memapsin-2 beta-Secretase (BACE-1) | beta-Secretase (BACE1)
Type:
Protein
Mol. Mass.:
55755.10
Organism:
Homo sapiens (Human)
Description:
P56817
Residue:
501
  
Inhibitor
Name:
BDBM50303727
Synonyms:
(4R)-2-amino-4-(4-fluoro-3-(2-fluoropyridin-3-yl)phenyl)-4-(4-methoxy-3-methylphenyl)-1-methyl-1H-imidazol-5(4H)-one | CHEMBL584695
Type:
Small organic molecule
Emp. Form.:
C23H20F2N4O2
Mol. Mass.:
422.4273
SMILES:
COc1ccc(cc1C)[C@@]1(N=C(N)N(C)C1=O)c1ccc(F)c(c1)-c1cccnc1F
: