Target
Beta-secretase 1
Ligand
BDBM50329549
Substrate
Meas. Tech.
ChEMBL_674717 (CHEMBL1273970)
IC50
20±n/a nM
Citation
 Malamas, MSRobichaud, AErdei, JQuagliato, DSolvibile, WZhou, PMorris, KTurner, JWagner, EFan, KOlland, AJacobsen, SReinhart, PRiddell, DPangalos, M Design and synthesis of aminohydantoins as potent and selective humanß-secretase (BACE1) inhibitors with enhanced brain permeability. Bioorg Med Chem Lett 20:6597-605 (2010)  
Target
Name:
Beta-secretase 1
Synonyms:
ASP2 Aspartyl protease 2 BACE1 Beta-secretase (BACE) Beta-secretase 1 (BACE 1) Beta-secretase 1 (BACE1) Beta-site amyloid precursor protein cleaving enzyme 1 Memapsin-2 beta-Secretase (BACE-1) | beta-Secretase (BACE1)
Type:
Protein
Mol. Mass.:
55755.10
Organism:
Homo sapiens (Human)
Description:
P56817
Residue:
501
  
Inhibitor
Name:
BDBM50329549
Synonyms:
(R)-2-amino-4-(4-(difluoromethoxy)phenyl)-1-methyl-4-(3-(3-methylbut-1-ynyl)phenyl)-1H-imidazol-5(4H)-one | CHEMBL1271245
Type:
Small organic molecule
Emp. Form.:
C22H21F2N3O2
Mol. Mass.:
397.4178
SMILES:
CC(C)C#Cc1cccc(c1)[C@]1(N=C(N)N(C)C1=O)c1ccc(OC(F)F)cc1
: