Target
Renin
Ligand
BDBM50329545
Substrate
Meas. Tech.
ChEMBL_674731 (CHEMBL1273984)
IC50
5900±n/a nM
Citation
 Malamas, MSRobichaud, AErdei, JQuagliato, DSolvibile, WZhou, PMorris, KTurner, JWagner, EFan, KOlland, AJacobsen, SReinhart, PRiddell, DPangalos, M Design and synthesis of aminohydantoins as potent and selective humanß-secretase (BACE1) inhibitors with enhanced brain permeability. Bioorg Med Chem Lett 20:6597-605 (2010)  
Target
Name:
Renin
Synonyms:
Angiotensinogenase RENI_HUMAN
Type:
Enzyme
Mol. Mass.:
45058.99
Organism:
Homo sapiens (Human)
Description:
Residue:
406
  
Inhibitor
Name:
BDBM50329545
Synonyms:
(R)-2-amino-4-(4-(difluoromethoxy)phenyl)-1-methyl-4-(3-(pent-1-ynyl)phenyl)-1H-imidazol-5(4H)-one | CHEMBL1271036
Type:
Small organic molecule
Emp. Form.:
C22H21F2N3O2
Mol. Mass.:
397.4178
SMILES:
CCCC#Cc1cccc(c1)[C@]1(N=C(N)N(C)C1=O)c1ccc(OC(F)F)cc1
: