Target
Carbonic anhydrase 1
Ligand
BDBM50329769
Substrate
Meas. Tech.
ChEMBL_674740 (CHEMBL1273993)
Kd
100000±n/a nM
Citation
 Sudžius, JBaranauskiene, LGolovenko, DMatuliene, JMichailoviene, VTorresan, JJachno, JSukackaite, RManakova, EGražulis, STumkevičius, SMatulis, D 4-[N-(substituted 4-pyrimidinyl)amino]benzenesulfonamides as inhibitors of carbonic anhydrase isozymes I, II, VII, and XIII. Bioorg Med Chem 18:7413-21 (2010)  
Target
Name:
Carbonic anhydrase 1
Synonyms:
CA-I CAB Carbonate dehydratase I Carbonic anhydrase 1 (CA I) Carbonic anhydrase 1 (Recombinant CA I) Carbonic anhydrase B Carbonic anhydrase I (CA I) Carbonic anhydrase I (CAI) Carbonic anhydrase isoenzyme I (hCA I) | hCA
Type:
Enzyme
Mol. Mass.:
28873.37
Organism:
Homo sapiens (Human)
Description:
P00915
Residue:
261
  
Inhibitor
Name:
BDBM50329769
Synonyms:
4-[N-(6-Benzylamino-5-cyano-2-methylthiopyrimidin-4-yl)amino]benzenesulfonamide | CHEMBL1271573
Type:
Small organic molecule
Emp. Form.:
C19H18N6O2S2
Mol. Mass.:
426.515
SMILES:
CSc1nc(NCc2ccccc2)c(C#N)c(Nc2ccc(cc2)S(N)(=O)=O)n1
: