Target
Carbonic anhydrase 13
Ligand
BDBM10880
Substrate
Meas. Tech.
ChEMBL_674746 (CHEMBL1273999)
Kd
50±n/a nM
Citation
 Sudžius, JBaranauskiene, LGolovenko, DMatuliene, JMichailoviene, VTorresan, JJachno, JSukackaite, RManakova, EGražulis, STumkevičius, SMatulis, D 4-[N-(substituted 4-pyrimidinyl)amino]benzenesulfonamides as inhibitors of carbonic anhydrase isozymes I, II, VII, and XIII. Bioorg Med Chem 18:7413-21 (2010)  
Target
Name:
Carbonic anhydrase 13
Synonyms:
CA13 Carbonic anhydrase Carbonic anhydrase XIII (CA XIII)
Type:
Enzyme
Mol. Mass.:
29445.78
Organism:
Homo sapiens (Human)
Description:
Q8N1Q1
Residue:
262
  
Inhibitor
Name:
BDBM10880
Synonyms:
AZA AZM acetazolamide Acetazolamide Acetazolamide (AZA) Acetazolamide, 5 Acetazolamide, AZA CHEMBL20 Sulfonamide, 1 US11278534, Example acetazolamide sulfonamide 1
Type:
Small organic molecule
Emp. Form.:
C4H6N4O3S2
Mol. Mass.:
222.245
SMILES:
CC(=O)Nc1nnc(s1)S(N)(=O)=O
: