Target
Peptidyl-prolyl cis-trans isomerase NIMA-interacting 1
Ligand
BDBM50329862
Substrate
Meas. Tech.
ChEMBL_675735 (CHEMBL1272369)
IC50
20000±n/a nM
Citation
 Potter, AOldfield, VNunns, CFromont, CRay, SNorthfield, CJBryant, CJScrace, SFRobinson, DMatossova, NBaker, LDokurno, PSurgenor, AEDavis, BRichardson, CMMurray, JBMoore, JD Discovery of cell-active phenyl-imidazole Pin1 inhibitors by structure-guided fragment evolution. Bioorg Med Chem Lett 20:6483-8 (2010)  
Target
Name:
Peptidyl-prolyl cis-trans isomerase NIMA-interacting 1
Synonyms:
PIN1 PPIase Pin1 | Peptidyl-prolyl cis-trans isomerase NIMA-interacting 1
Type:
PROTEIN
Mol. Mass.:
18248.11
Organism:
Homo sapiens (Human)
Description:
ChEMBL_1502595
Residue:
163
  
Inhibitor
Name:
BDBM50329862
Synonyms:
2-(3-CHLORO-PHENYL)-5-METHYL-1H-IMIDAZOLE-4-CARBOXYLIC ACID CHEMBL1230284
Type:
Small organic molecule
Emp. Form.:
C11H9ClN2O2
Mol. Mass.:
236.654
SMILES:
Cc1nc([nH]c1C(O)=O)-c1cccc(Cl)c1
: