Target
MAP kinase-interacting serine/threonine-protein kinase 1
Ligand
BDBM50329879
Substrate
Meas. Tech.
ChEMBL_675751 (CHEMBL1272385)
IC50
45±n/a nM
Citation
 Machrouhi, FOuhamou, NLaderoute, KCalaoagan, JBukhtiyarova, MEhrlich, PJKlon, AE The rational design of a novel potent analogue of the 5'-AMP-activated protein kinase inhibitor compound C with improved selectivity and cellular activity. Bioorg Med Chem Lett 20:6394-9 (2010)  
Target
Name:
MAP kinase-interacting serine/threonine-protein kinase 1
Synonyms:
MAP Kinase-Interacting Protein Kinase (MNK1) MAP kinase-interacting serine/threonine-protein kinase 1 (MnK1) MAP-kinase interacting kinase 1 (MNK1) MKNK1 MNK1
Type:
Serine/threonine-protein kinase
Mol. Mass.:
51342.85
Organism:
Homo sapiens (Human)
Description:
Q9BUB5
Residue:
465
  
Inhibitor
Name:
BDBM50329879
Synonyms:
5-(6-(4-(2-morpholinoethoxy)phenyl)pyrazolo[1,5-a]pyrimidin-3-yl)pyridin-2(1H)-one | CHEMBL1271480
Type:
Small organic molecule
Emp. Form.:
C23H23N5O3
Mol. Mass.:
417.4604
SMILES:
O=c1ccc(c[nH]1)-c1cnn2cc(cnc12)-c1ccc(OCCN2CCOCC2)cc1
: