Target
Polyphenol oxidase 2
Ligand
BDBM50330111
Substrate
Meas. Tech.
ChEMBL_676155 (CHEMBL1273206)
IC50
97±n/a nM
Citation
 Rho, HSAhn, SMYoo, DSKim, MKCho, DHCho, JY Kojyl thioether derivatives having both tyrosinase inhibitory and anti-inflammatory properties. Bioorg Med Chem Lett 20:6569-71 (2010)  
Target
Name:
Polyphenol oxidase 2
Synonyms:
Monophenol monooxygenase PPO2 Tyrosinase
Type:
Protein
Mol. Mass.:
63923.66
Organism:
Agaricus bisporus (Common mushroom)
Description:
O42713
Residue:
556
  
Inhibitor
Name:
BDBM50330111
Synonyms:
5-hydroxy-2-(pentylthiomethyl)-4H-pyran-4-one | CHEMBL1269399
Type:
Small organic molecule
Emp. Form.:
C11H16O3S
Mol. Mass.:
228.308
SMILES:
CCCCCSCc1cc(=O)c(O)co1
: