Target
Serine/threonine-protein kinase Nek2
Ligand
BDBM50330574
Substrate
Meas. Tech.
ChEMBL_685030 (CHEMBL1286646)
IC50
1900±n/a nM
Citation
 Whelligan, DKSolanki, STaylor, DThomson, DWCheung, KMBoxall, KMas-Droux, CBarillari, CBurns, SGrummitt, CGCollins, Ivan Montfort, RLAherne, GWBayliss, RHoelder, S Aminopyrazine inhibitors binding to an unusual inactive conformation of the mitotic kinase Nek2: SAR and structural characterization. J Med Chem 53:7682-98 (2010)  
Target
Name:
Serine/threonine-protein kinase Nek2
Synonyms:
NEK kinase NEK2A NLK1
Type:
Enzyme
Mol. Mass.:
51776.96
Organism:
Homo sapiens (Human)
Description:
P51955
Residue:
445
  
Inhibitor
Name:
BDBM50330574
Synonyms:
1-(3-amino-6-(3-ethylthiophen-2-yl)pyrazin-2-yl)piperidine-4-carboxylic acid | CHEMBL1277019
Type:
Small organic molecule
Emp. Form.:
C16H20N4O2S
Mol. Mass.:
332.421
SMILES:
CCc1ccsc1-c1cnc(N)c(n1)N1CCC(CC1)C(O)=O
: