Target
Serine/threonine-protein kinase PLK1
Ligand
BDBM50330574
Substrate
Meas. Tech.
ChEMBL_685026 (CHEMBL1286642)
Temperature
298.15±n/a K
IC50
8500±n/a nM
Comments
extracted
Citation
 Whelligan, DKSolanki, STaylor, DThomson, DWCheung, KMBoxall, KMas-Droux, CBarillari, CBurns, SGrummitt, CGCollins, Ivan Montfort, RLAherne, GWBayliss, RHoelder, S Aminopyrazine inhibitors binding to an unusual inactive conformation of the mitotic kinase Nek2: SAR and structural characterization. J Med Chem 53:7682-98 (2010)  
Target
Name:
Serine/threonine-protein kinase PLK1
Synonyms:
PLK PLK1 Polo-like kinase 1 (PlK1) STPK13 Serine/threonine-protein kinase 13 | polo-like kinase
Type:
Serine/threonine-protein kinase
Mol. Mass.:
68277.16
Organism:
Homo sapiens (Human)
Description:
P53350
Residue:
603
  
Inhibitor
Name:
BDBM50330574
Synonyms:
1-(3-amino-6-(3-ethylthiophen-2-yl)pyrazin-2-yl)piperidine-4-carboxylic acid | CHEMBL1277019
Type:
Small organic molecule
Emp. Form.:
C16H20N4O2S
Mol. Mass.:
332.421
SMILES:
CCc1ccsc1-c1cnc(N)c(n1)N1CCC(CC1)C(O)=O
: