Target
Serine/threonine-protein kinase Nek2
Ligand
BDBM50330597
Substrate
Meas. Tech.
ChEMBL_685025 (CHEMBL1286641)
IC50
>50000±n/a nM
Citation
 Whelligan, DKSolanki, STaylor, DThomson, DWCheung, KMBoxall, KMas-Droux, CBarillari, CBurns, SGrummitt, CGCollins, Ivan Montfort, RLAherne, GWBayliss, RHoelder, S Aminopyrazine inhibitors binding to an unusual inactive conformation of the mitotic kinase Nek2: SAR and structural characterization. J Med Chem 53:7682-98 (2010)  
Target
Name:
Serine/threonine-protein kinase Nek2
Synonyms:
NEK kinase NEK2A NLK1
Type:
Enzyme
Mol. Mass.:
51776.96
Organism:
Homo sapiens (Human)
Description:
P51955
Residue:
445
  
Inhibitor
Name:
BDBM50330597
Synonyms:
4-(3-amino-6-(3,4,5-trimethoxyphenyl)pyrazin-2-yl)-3-methylbenzoic acid | CHEMBL1277569
Type:
Small organic molecule
Emp. Form.:
C21H21N3O5
Mol. Mass.:
395.4085
SMILES:
COc1cc(cc(OC)c1OC)-c1cnc(N)c(n1)-c1ccc(cc1C)C(O)=O
: