Target
Adenosine receptor A1
Ligand
BDBM50330632
Substrate
Meas. Tech.
ChEMBL_685066 (CHEMBL1286682)
Ki
10±n/a nM
Citation
 Giovannoni, MPVergelli, CCilibrizzi, ACrocetti, LBiancalani, CGraziano, ADal Piaz, VLoza, MICadavid, MIDíaz, JLGavaldà, A Pyrazolo[1',5':1,6]pyrimido[4,5-d]pyridazin-4(3H)-ones as selective human A(1) adenosine receptor ligands. Bioorg Med Chem 18:7890-9 (2010)  
Target
Name:
Adenosine receptor A1
Synonyms:
A1 adenosine receptor (hA1) AA1R_HUMAN ADORA1 Adenosine A1-receptor Adenosine receptor A1 (hA1) | Adenosine transporter (AdT)
Type:
G Protein-Coupled Receptor (GPCR)
Mol. Mass.:
36520.92
Organism:
Homo sapiens (Human)
Description:
P30542
Residue:
326
  
Inhibitor
Name:
BDBM50330632
Synonyms:
3-Benzyl-9-phenyl-1-pyridin-4-yl-pyrazolo[1',5':1,6]pyrimido[4,5-d]pyridazin-4(3H)-one | CHEMBL1277025
Type:
Small organic molecule
Emp. Form.:
C26H18N6O
Mol. Mass.:
430.4607
SMILES:
O=c1n(Cc2ccccc2)nc(-c2ccncc2)c2c3cc(nn3cnc12)-c1ccccc1
: