Target
NADPH oxidase 4
Ligand
BDBM50330740
Substrate
Meas. Tech.
ChEMBL_685143 (CHEMBL1286959)
Ki
65±n/a nM
Citation
 Laleu, BGaggini, FOrchard, MFioraso-Cartier, LCagnon, LHoungninou-Molango, SGradia, ADuboux, GMerlot, CHeitz, FSzyndralewiez, CPage, P First in class, potent, and orally bioavailable NADPH oxidase isoform 4 (Nox4) inhibitors for the treatment of idiopathic pulmonary fibrosis. J Med Chem 53:7715-30 (2010)  
Target
Name:
NADPH oxidase 4
Synonyms:
KOX-1 Kidney superoxide-producing NADPH oxidase NOX4_HUMAN Renal NAD(P)H-oxidase
Type:
PROTEIN
Mol. Mass.:
66954.54
Organism:
Homo sapiens (Human)
Description:
ChEMBL_792879
Residue:
578
  
Inhibitor
Name:
BDBM50330740
Synonyms:
2-(2-chlorophenyl)-4-((4-(3-methoxyphenyl)piperazin-1-yl)methyl)-5-methyl-1H-pyrazolo[4,3-c]pyridine-3,6(2H,5H)-dione | CHEMBL1277767
Type:
Small organic molecule
Emp. Form.:
C25H26ClN5O3
Mol. Mass.:
479.959
SMILES:
COc1cccc(c1)N1CCN(Cc2n(C)c(=O)cc3[nH]n(-c4ccccc4Cl)c(=O)c23)CC1
: