Target
NADPH oxidase 4
Ligand
BDBM50330746
Substrate
Meas. Tech.
ChEMBL_685143 (CHEMBL1286959)
Ki
128±n/a nM
Citation
 Laleu, BGaggini, FOrchard, MFioraso-Cartier, LCagnon, LHoungninou-Molango, SGradia, ADuboux, GMerlot, CHeitz, FSzyndralewiez, CPage, P First in class, potent, and orally bioavailable NADPH oxidase isoform 4 (Nox4) inhibitors for the treatment of idiopathic pulmonary fibrosis. J Med Chem 53:7715-30 (2010)  
Target
Name:
NADPH oxidase 4
Synonyms:
KOX-1 Kidney superoxide-producing NADPH oxidase NOX4_HUMAN Renal NAD(P)H-oxidase
Type:
PROTEIN
Mol. Mass.:
66954.54
Organism:
Homo sapiens (Human)
Description:
ChEMBL_792879
Residue:
578
  
Inhibitor
Name:
BDBM50330746
Synonyms:
2-(2-chlorophenyl)-4-(2-fluorophenyl)-5-methyl-1H-pyrazolo[4,3-c]pyridine-3,6(2H,5H)-dione | CHEMBL1278018
Type:
Small organic molecule
Emp. Form.:
C19H13ClFN3O2
Mol. Mass.:
369.777
SMILES:
Cn1c(-c2ccccc2F)c2c(cc1=O)[nH]n(-c1ccccc1Cl)c2=O
: