Target
Histamine H1 receptor
Ligand
BDBM50002087
Substrate
Meas. Tech.
ChEMBL_685205 (CHEMBL1287093)
Ki
0.158±n/a nM
Citation
 Gianotti, MBotta, MBrough, SCarletti, RCastiglioni, ECorti, CDal-Cin, MDelle Fratte, SKorajac, DLovric, MMerlo, GMesic, MPavone, FPiccoli, LRast, SRoscic, MSava, ASmehil, MStasi, LTogninelli, AWigglesworth, MJ Novel spirotetracyclic zwitterionic dual H(1)/5-HT(2A) receptor antagonists for the treatment of sleep disorders. J Med Chem 53:7778-95 (2010)  
Target
Name:
Histamine H1 receptor
Synonyms:
H1R HISTAMINE H1 HRH1_HUMAN
Type:
G Protein-Coupled Receptor (GPCR)
Mol. Mass.:
55808.72
Organism:
Homo sapiens (Human)
Description:
Cell pellets from SK-N-MC cells transfected with human H1 receptor were used in binding assay.
Residue:
487
  
Inhibitor
Name:
BDBM50002087
Synonyms:
4-(1-Methyl-piperidin-4-ylidene)-4,9-dihydro-1-thia-benzo[f]azulen-10-one(Ketotifen hydrogen malate) 4-(1-methyl-piperidin-4-ylidene)-4,9-dihydro-1-thia-benzo[f]azulen-10-one KETOTIFEN | Zaditor
Type:
Small organic molecule
Emp. Form.:
C19H19NOS
Mol. Mass.:
309.425
SMILES:
[#6]-[#7]-1-[#6]-[#6]\[#6](-[#6]-[#6]-1)=[#6]-1\c2ccsc2-[#6](=O)-[#6]-c2ccccc-12
: