Target
Sodium-dependent noradrenaline transporter
Ligand
BDBM50330814
Substrate
Meas. Tech.
ChEMBL_685484 (CHEMBL1285515)
IC50
2100±n/a nM
Citation
 King, HDMeng, ZDeskus, JASloan, CPGao, QBeno, BRKozlowski, ESLapaglia, MAMattson, GKMolski, TFTaber, MTLodge, NJMattson, RJMacor, JE Conformationally restricted homotryptamines. Part 7: 3-cis-(3-aminocyclopentyl)indoles as potent selective serotonin reuptake inhibitors. J Med Chem 53:7564-72 (2010)  
Target
Name:
Sodium-dependent noradrenaline transporter
Synonyms:
Monoamine transporter NET Noradrenaline Transporter (NET) Norepinephrine transporter protein (NET) SLC6A2 Sodium-dependent noradrenaline transporter (NET) | Solute carrier family 6 member 2
Type:
Multi-pass membrane protein
Mol. Mass.:
69337.72
Organism:
Homo sapiens (Human)
Description:
P23975
Residue:
617
  
Inhibitor
Name:
BDBM50330814
Synonyms:
CHEMBL1275791 | [(1R,3S)-3-(5-Fluoro-1H-indol-3-yl)-cyclopentyl]-dimethylamine
Type:
Small organic molecule
Emp. Form.:
C15H19FN2
Mol. Mass.:
246.3232
SMILES:
CN(C)[C@H]1CC[C@H](C1)c1c[nH]c2ccc(F)cc12
: