Target
Sodium channel protein type 10 subunit alpha
Ligand
BDBM50330942
Substrate
Meas. Tech.
ChEMBL_684074 (CHEMBL1286451)
IC50
240±n/a nM
Citation
 Scanio, MJShi, LDrizin, IGregg, RJAtkinson, RNThomas, JBJohnson, MSChapman, MLLiu, DKrambis, MJLiu, YShieh, CCZhang, XSimler, GHJoshi, SHonore, PMarsh, KCKnox, AWerness, SAntonio, BKrafte, DSJarvis, MFFaltynek, CRMarron, BEKort, ME Discovery and biological evaluation of potent, selective, orally bioavailable, pyrazine-based blockers of the Na(v)1.8 sodium channel with efficacy in a model of neuropathic pain. Bioorg Med Chem 18:7816-25 (2010)  
Target
Name:
Sodium channel protein type 10 subunit alpha
Synonyms:
SCNAA_MOUSE Sns Sodium channel protein type X alpha subunit
Type:
PROTEIN
Mol. Mass.:
220545.77
Organism:
Mus musculus
Description:
ChEMBL_675096
Residue:
1958
  
Inhibitor
Name:
BDBM50330942
Synonyms:
CHEMBL1278224 | N-(2-methylbenzyl)-6-(4-(trifluoromethoxy)phenyl)pyrazine-2-carboxamide
Type:
Small organic molecule
Emp. Form.:
C20H16F3N3O2
Mol. Mass.:
387.3551
SMILES:
Cc1ccccc1CNC(=O)c1cncc(n1)-c1ccc(OC(F)(F)F)cc1
: