Target
Sodium channel protein type 10 subunit alpha
Ligand
BDBM50330935
Substrate
Meas. Tech.
ChEMBL_684075 (CHEMBL1286452)
IC50
1±n/a nM
Citation
 Scanio, MJShi, LDrizin, IGregg, RJAtkinson, RNThomas, JBJohnson, MSChapman, MLLiu, DKrambis, MJLiu, YShieh, CCZhang, XSimler, GHJoshi, SHonore, PMarsh, KCKnox, AWerness, SAntonio, BKrafte, DSJarvis, MFFaltynek, CRMarron, BEKort, ME Discovery and biological evaluation of potent, selective, orally bioavailable, pyrazine-based blockers of the Na(v)1.8 sodium channel with efficacy in a model of neuropathic pain. Bioorg Med Chem 18:7816-25 (2010)  
Target
Name:
Sodium channel protein type 10 subunit alpha
Synonyms:
PN3 SCN10A Sodium channel alpha subunit Sodium channel protein type X alpha subunit fret-membrane potential nav1.8 | hPN3
Type:
Enzyme
Mol. Mass.:
220609.21
Organism:
Homo sapiens (Human)
Description:
Q9Y5Y9
Residue:
1956
  
Inhibitor
Name:
BDBM50330935
Synonyms:
CHEMBL1277958 | N-(m-Tolyl)-6-(4-ethoxyphenyl)-pyrazine-2-carboxamide
Type:
Small organic molecule
Emp. Form.:
C20H19N3O2
Mol. Mass.:
333.3838
SMILES:
CCOc1ccc(cc1)-c1cncc(n1)C(=O)Nc1cccc(C)c1
: