Target
17-beta-hydroxysteroid dehydrogenase type 1
Ligand
BDBM50331002
Substrate
Meas. Tech.
ChEMBL_684640 (CHEMBL1285473)
IC50
126±n/a nM
Citation
 Oster, AHinsberger, SWerth, RMarchais-Oberwinkler, SFrotscher, MHartmann, RW Bicyclic substituted hydroxyphenylmethanones as novel inhibitors of 17ß-hydroxysteroid dehydrogenase type 1 (17ß-HSD1) for the treatment of estrogen-dependent diseases. J Med Chem 53:8176-86 (2010)  
Target
Name:
17-beta-hydroxysteroid dehydrogenase type 1
Synonyms:
17-beta-HSD 1 17-beta-hydroxysteroid dehydrogenase type 1 20-alpha-HSD E17KSR EDH17B1 EDHB17 Estradiol 17-beta-dehydrogenase 1 (17beta-HSD1) Placental 17-beta-hydroxysteroid dehydrogenase | SDR28C1
Type:
Enzyme
Mol. Mass.:
34945.13
Organism:
Homo sapiens (Human)
Description:
P14061
Residue:
328
  
Inhibitor
Name:
BDBM50331002
Synonyms:
CHEMBL1277801 | [5-(3-Chloro-4-hydroxyphenyl)-2-thienyl](3-hydroxyphenyl)-methanone
Type:
Small organic molecule
Emp. Form.:
C17H11ClO3S
Mol. Mass.:
330.785
SMILES:
Oc1cccc(c1)C(=O)c1ccc(s1)-c1ccc(O)c(Cl)c1
: