Target
Leucyl-cystinyl aminopeptidase
Ligand
BDBM50331042
Substrate
Meas. Tech.
ChEMBL_684889 (CHEMBL1286213)
Ki
35±n/a nM
Citation
 Andersson, HDemaegdt, HVauquelin, GLindeberg, GKarlén, AHallberg, MErdélyi, MHallberg, A Disulfide cyclized tripeptide analogues of angiotensin IV as potent and selective inhibitors of insulin-regulated aminopeptidase (IRAP). J Med Chem 53:8059-71 (2010)  
Target
Name:
Leucyl-cystinyl aminopeptidase
Synonyms:
Aminopeptidase Cystinyl aminopeptidase Insulin-regulated membrane aminopeptidase LCAP_HUMAN Leucyl-cystinyl aminopeptidase, pregnancy serum form Oxytocinase Placental leucine aminopeptidase
Type:
PROTEIN
Mol. Mass.:
117334.10
Organism:
Homo sapiens (Human)
Description:
ChEMBL_1473494
Residue:
1025
  
Inhibitor
Name:
BDBM50331042
Synonyms:
2-(2-(((4R,8S,11S)-11-amino-8-(4-hydroxybenzyl)-6,10-dioxo-1,2-dithia-5,9-diazacyclotridecane-4-carboxamido)methyl)phenyl)acetic acid | CHEMBL1277623
Type:
Small organic molecule
Emp. Form.:
C26H32N4O6S2
Mol. Mass.:
560.685
SMILES:
N[C@H]1CCSSC[C@H](NC(=O)C[C@H](Cc2ccc(O)cc2)NC1=O)C(=O)NCc1ccccc1CC(O)=O
: