Target
Melanin-concentrating hormone receptor 1
Ligand
BDBM50331199
Substrate
Meas. Tech.
ChEMBL_686483 (CHEMBL1292270)
Ki
2.6±n/a nM
Citation
 Henderson, AJDeering, DGrabowski, JFHadden, MJiang, XKhmelnitsky, YLuche, MSurman, MDCheetham, SVickers, SViggers, JGuzzo, PR Tetrahydrocarboline analogs as MCH-1 antagonists. Bioorg Med Chem Lett 20:7024-8 (2010)  
Target
Name:
Melanin-concentrating hormone receptor 1
Synonyms:
G-protein coupled receptor 24 MCH receptor 1 MCH-R1 MCHR-1 MCHR1_HUMAN Melanin-Concentrating Hormone Receptor 1 (MCH1R) Melanin-concentrating hormone receptor 1 (MCH-1) Melanin-concentrating hormone receptor 1 (MCHR-1) SLC-1 Somatostatin receptor-like protein
Type:
G Protein-Coupled Receptor (GPCR)
Mol. Mass.:
45976.27
Organism:
Homo sapiens (Human)
Description:
Membranes from CHO-K1 cells stably expressing human MCH1R were used in assays.
Residue:
422
  
Inhibitor
Name:
BDBM50331199
Synonyms:
4-(4-methoxyphenyl)-1-(5-methyl-2,3,4,5-tetrahydro-1H-pyrido[4,3-b]indol-7-yl)pyridin-2(1H)-one | CHEMBL1290720
Type:
Small organic molecule
Emp. Form.:
C24H23N3O2
Mol. Mass.:
385.4583
SMILES:
COc1ccc(cc1)-c1ccn(-c2ccc3c4CNCCc4n(C)c3c2)c(=O)c1
: