Target
Nuclear factor NF-kappa-B p105 subunit
Ligand
BDBM50331542
Substrate
Meas. Tech.
ChEMBL_687291 (CHEMBL1291967)
IC50
20000±n/a nM
Citation
 Piccagli, LBorgatti, MNicolis, EBianchi, NMancini, ILampronti, IVevaldi, DDall'Acqua, FCabrini, GGambari, R Virtual screening against nuclear factor¿B (NF-¿B) of a focus library: Identification of bioactive furocoumarin derivatives inhibiting NF-¿B dependent biological functions involved in cystic fibrosis. Bioorg Med Chem 18:8341-9 (2010)  
Target
Name:
Nuclear factor NF-kappa-B p105 subunit
Synonyms:
NFKB1 Nuclear factor NF-kappa-B (NF-kB) Nuclear factor NF-kappa-B p105 subunit
Type:
Protein
Mol. Mass.:
105329.57
Organism:
Homo sapiens (Human)
Description:
P19838
Residue:
968
  
Inhibitor
Name:
BDBM50331542
Synonyms:
3-(benzo[d][1,3]dioxol-5-yl)-5-phenyl-7H-furo[3,2-g]chromen-7-one | CHEMBL1287836
Type:
Small organic molecule
Emp. Form.:
C24H14O5
Mol. Mass.:
382.365
SMILES:
O=c1cc(-c2ccccc2)c2cc3c(coc3cc2o1)-c1ccc2OCOc2c1
: