Target
Cathepsin L2
Ligand
BDBM50331556
Substrate
Meas. Tech.
ChEMBL_687420 (CHEMBL1292096)
IC50
36.3±n/a nM
Citation
 Cai, JRobinson, JBelshaw, SEverett, KFradera, Xvan Zeeland, Mvan Berkom, Lvan Rijnsbergen, PPopplestone, LBaugh, MDempster, MBruin, JHamilton, WKinghorn, EWestwood, PKerr, JRankovic, ZArbuckle, WBennett, DJJones, PSLong, CMartin, IUitdehaag, JCMeulemans, T Trifluoromethylphenyl as P2 for ketoamide-based cathepsin S inhibitors. Bioorg Med Chem Lett 20:6890-4 (2010)  
Target
Name:
Cathepsin L2
Synonyms:
CATL2 CTSL2 CTSV Cathepsin V
Type:
Enzyme
Mol. Mass.:
37341.06
Organism:
Homo sapiens (Human)
Description:
O60911
Residue:
334
  
Inhibitor
Name:
BDBM50331556
Synonyms:
2-chloro-N-(4-(1-methyl-1H-pyrazol-3-ylamino)-3,4-dioxobutan-2-yl)-4-(pyridin-2-ylmethoxy)-3-(trifluoromethyl)benzamide | CHEMBL1289644
Type:
Small organic molecule
Emp. Form.:
C22H19ClF3N5O4
Mol. Mass.:
509.866
SMILES:
CC(NC(=O)c1ccc(OCc2ccccn2)c(c1Cl)C(F)(F)F)C(=O)C(=O)Nc1ccn(C)n1
: