Target
Mitogen-activated protein kinase 14
Ligand
BDBM50331619
Substrate
Meas. Tech.
ChEMBL_687483 (CHEMBL1292159)
IC50
10±n/a nM
Citation
 Das, JMoquin, RVDyckman, AJLi, TPitt, SZhang, RShen, DRMcIntyre, KWGillooly, KDoweyko, AMNewitt, JASack, JSZhang, HKiefer, SEKish, KMcKinnon, MBarrish, JCDodd, JHSchieven, GLLeftheris, K 5-amino-pyrazoles as potent and selective p38a inhibitors. Bioorg Med Chem Lett 20:6886-9 (2010)  
Target
Name:
Mitogen-activated protein kinase 14
Synonyms:
CSAID-binding protein CSBP1 CSPB1 MAP kinase 14 MAP kinase p38 alpha MAPK14 MK14_HUMAN Mitogen-activated protein kinase p38 alpha Stress-activated protein kinase 2a | p38 MAP kinase alpha/beta
Type:
Serine/threonine-protein kinase
Mol. Mass.:
41286.76
Organism:
Homo sapiens (Human)
Description:
Q16539
Residue:
360
  
Inhibitor
Name:
BDBM50331619
Synonyms:
CHEMBL410668 N,4-dimethyl-3-[(1-phenyl-1H-pyrazolo[3,4-d]pyrimidin-4-yl)amino]benzamide
Type:
Small organic molecule
Emp. Form.:
C20H18N6O
Mol. Mass.:
358.3965
SMILES:
CNC(=O)c1ccc(C)c(Nc2ncnc3n(ncc23)-c2ccccc2)c1
: