Target
C-C chemokine receptor type 2
Ligand
BDBM50331725
Substrate
Meas. Tech.
ChEMBL_687876 (CHEMBL1291440)
IC50
51±n/a nM
Citation
 Xue, CBWang, AMeloni, DZhang, KKong, LFeng, HGlenn, JHuang, TZhang, YCao, GAnand, RZheng, CXia, MHan, QRobinson, DJStorace, LShao, LLi, MBrodmerkel, CMCovington, MScherle, PDiamond, SYeleswaram, SVaddi, KNewton, RHollis, GFriedman, SMetcalf, B Discovery of INCB3344, a potent, selective and orally bioavailable antagonist of human and murine CCR2. Bioorg Med Chem Lett 20:7473-8 (2010)  
Target
Name:
C-C chemokine receptor type 2
Synonyms:
CCR2_MOUSE Cmkbr2
Type:
PROTEIN
Mol. Mass.:
42795.68
Organism:
Mus musculus
Description:
ChEMBL_1502265
Residue:
373
  
Inhibitor
Name:
BDBM50331725
Synonyms:
CHEMBL1288324 | N-(2-((3S,4S)-4-(benzyloxy)-1-(cis-4-phenylcyclohexyl)pyrrolidin-3-ylamino)-2-oxoethyl)-3-(trifluoromethyl)benzamide
Type:
Small organic molecule
Emp. Form.:
C33H36F3N3O3
Mol. Mass.:
579.6524
SMILES:
FC(F)(F)c1cccc(c1)C(=O)NCC(=O)N[C@H]1CN(C[C@@H]1OCc1ccccc1)[C@H]1CC[C@H](CC1)c1ccccc1
: