Target
Prostaglandin D2 receptor
Ligand
BDBM50331729
Substrate
Meas. Tech.
ChEMBL_687945 (CHEMBL1291617)
Ki
1.3±n/a nM
Citation
 Li, LBeaulieu, CCarriere, MCDenis, DGreig, GGuay, DO'Neill, GZamboni, RWang, Z Potent and highly selective DP1 antagonists with 2,3,4,9-tetrahydro-1H-carbazole as pharmacophore. Bioorg Med Chem Lett 20:7462-5 (2010)  
Target
Name:
Prostaglandin D2 receptor
Synonyms:
PD2R_HUMAN Prostaglandin D2 Prostanoid DP receptor
Type:
Enzyme
Mol. Mass.:
40288.87
Organism:
Homo sapiens (Human)
Description:
Q13258
Residue:
359
  
Inhibitor
Name:
BDBM50331729
Synonyms:
2-(9-(1-(4-chlorophenyl)ethyl)-6-fluoro-8-(methylsulfonyl)-2,3,4,9-tetrahydro-1H-carbazol-1-yl)acetic acid | CHEMBL1289084
Type:
Small organic molecule
Emp. Form.:
C23H23ClFNO4S
Mol. Mass.:
463.949
SMILES:
CC(c1ccc(Cl)cc1)n1c2C(CC(O)=O)CCCc2c2cc(F)cc(c12)S(C)(=O)=O
: