Target
Polyunsaturated fatty acid 5-lipoxygenase
Ligand
BDBM50331797
Substrate
Meas. Tech.
ChEMBL_686760 (CHEMBL1290999)
IC50
11±n/a nM
Citation
 Li, LBerthelette, CChateauneuf, AOuellet, MSturino, CFWang, Z Potent and selective 5-LO inhibitor bearing benzothiophene pharmacophore: discovery of MK-5286. Bioorg Med Chem Lett 20:7440-3 (2010)  
Target
Name:
Polyunsaturated fatty acid 5-lipoxygenase
Synonyms:
5-LO 5-Lipoxygenase (5-LO) 5-Lipoygenase ALOX5 LOG5 | LOX5_HUMAN
Type:
Enzyme
Mol. Mass.:
77972.74
Organism:
Homo sapiens (Human)
Description:
Recombinant protein was purified from E. coli lysate. After ammonium sulfate precipitation and subsequent steps, the supernatant (S100) was used for 5-LO activity assay.
Residue:
674
  
Inhibitor
Name:
BDBM50331797
Synonyms:
1-(3-phenyl-6-((4-(1,1,1-trifluoro-2-hydroxybutan-2-yl)-1H-1,2,3-triazol-1-yl)methyl)benzo[b]thiophen-2-yl)ethanone | CHEMBL1289215
Type:
Small organic molecule
Emp. Form.:
C23H20F3N3O2S
Mol. Mass.:
459.484
SMILES:
CCC(O)(c1cn(Cc2ccc3c(c(sc3c2)C(C)=O)-c2ccccc2)nn1)C(F)(F)F
: