Target
Receptor-type tyrosine-protein phosphatase C
Ligand
BDBM50331944
Substrate
Meas. Tech.
ChEMBL_687384 (CHEMBL1292060)
Ki
40000±n/a nM
Citation
 Tulsi, NSDowney, AMCairo, CW A protected l-bromophosphonomethylphenylalanine amino acid derivative (BrPmp) for synthesis of irreversible protein tyrosine phosphatase inhibitors. Bioorg Med Chem 18:8679-86 (2010)  
Target
Name:
Receptor-type tyrosine-protein phosphatase C
Synonyms:
CD45 L-CA PTPRC Receptor-type tyrosine-protein phosphatase C (CD45) | T200
Type:
Protein
Mol. Mass.:
147474.19
Organism:
Homo sapiens (Human)
Description:
P08575
Residue:
1306
  
Inhibitor
Name:
BDBM50331944
Synonyms:
CHEMBL1288332 | L-BrPmp-OH
Type:
Small organic molecule
Emp. Form.:
C10H13BrNO5P
Mol. Mass.:
338.092
SMILES:
N[C@@H](Cc1ccc(cc1)C(Br)P(O)(O)=O)C(O)=O
: